Patient_Number,Survey_Number,Date_Survey_Sent_Clinic_Date,Postcode,Ethnic_Group,Ethnic_Group_Elsewhere,Height_cm,Weight_kg,BMI,Smoke,Smoke_per_Day,Ever_Smoked,Smoked_Years,Alcohol,Exercise,Exercise_Amount,Occupation
133099,000000133099-1,23/11/2004,B36,1,,152,56,24,0,,0,,2,1,1,5
140949,000000140949-1,25/01/2005,BA2,1,,173,66,22,0,,0,,3,1,1,2
139622,000000139622-1,11/01/2005,BN01,1,,178,85,27,0,,0,,0,1,2,2
86844,000000086844-1,08/02/2005,BS09,1,,157,54,22,0,,0,,0,0,,2
560,000000000560-1,09/01/2003,BS13,1,,160,81,32,1,10,,,6,1,1,1
145072,000000145072-1,09/03/2005,BS15,1,,155,57,24,0,,0,,6,0,,5
132869,000000132869-1,23/11/2004,BS15,1,,180,69,21,0,,1,20,40,1,2,1
147969,000000147969-1,29/03/2005,BS23,1,,137,64,34,,,1,20,7,1,2,1
142558,000000142558-1,08/02/2005,BS6,1,,190,83,23,0,,0,,1,1,2,1
141645,000000141645-1,01/02/2005,CB4,1,,165,58,21,0,,1,6,6,1,1,1
144184,000000144184-1,02/03/2005,CF02,1,,180,92,28,0,,1,35,30,1,1,1
443,000000000443-1,27/01/2003,CF03,,,,,,,,,,,,,
1432,000000001432-1,10/07/2002,CF03,,,,,,,,,,,,,
1471,000000001471-1,10/03/2003,CF03,1,,,,,,,,,,,,
114877,000000114877-2,01/02/2005,CF03,1,,,95,,0,,1,45,12,0,,2
148656,000000148656-1,06/04/2005,CF03,1,,,114,,0,,0,,1,0,,4
139764,000000139764-1,11/01/2005,CF03,1,,,69,,0,,1,45,0,0,,1
137503,000000137503-1,08/12/2004,CF03,1,,,,,0,,1,,0,0,,6
3,000000000003-2,25/02/2004,CF03,1,,,69,,0,,0,,0,1,2,7
805,000000000805-1,21/03/2003,CF03,1,,,64,,0,,1,,0,1,2,5
2064,000000002064-2,09/01/2004,CF03,1,,,50,,0,,1,25,0,0,,1
5757,000000005757-2,03/11/2003,CF03,1,,,,,0,,1,45,1,0,,5
2715,000000002715-1,06/12/2002,CF03,,,,64,,0,,1,,,1,2,
7129,000000007129-1,28/02/2003,CF03,1,,,51,,0,,0,,0,0,,7
7698,000000007698-1,21/03/2005,CF03,1,,,64,,1,15,,40,10,1,2,4
5572,000000005572-1,21/02/2003,CF03,1,,,57,,1,10,,,0,1,1,
22855,000000022855-2,08/03/2005,CF03,1,,142,85,42,1,10,,35,2,1,1,7
78819,000000078819-1,02/03/2005,CF03,1,,145,44,21,0,,1,,7,0,,1
107318,000000107318-2,24/11/2004,CF03,1,,145,51,24,0,,1,30,0,1,2,2
176,000000000176-2,24/03/2004,CF03,1,,147,62,28,0,,1,5,2,0,,1
111169,000000111169-1,31/03/2005,CF03,1,,150,56,25,0,,1,35,10,1,2,1
178,000000000178-2,25/02/2004,CF03,1,,150,74,33,0,,0,,,1,2,2
300,000000000300-2,13/02/2004,CF03,1,,150,93,41,0,,1,12,2,0,,2
5284,000000005284-2,08/09/2003,CF03,1,,150,54,24,0,,0,,0,0,,5
138845,000000138845-1,05/01/2005,CF03,1,,152,71,31,0,,0,,0,0,,2
139449,000000139449-1,11/01/2005,CF03,1,,152,51,22,0,,0,,0,0,,3
554,000000000554-3,12/01/2005,CF03,3,,152,80,34,0,,1,25,,1,1,4
143429,000000143429-1,15/02/2005,CF03,1,,152,,,0,,0,,0,1,2,7
69037,000000069037-2,02/03/2005,CF03,1,,152,44,19,0,,0,,0,1,2,1
348,000000000348-3,09/12/2004,CF03,1,,152,55,24,0,,1,30,0,0,,5
138915,000000138915-1,05/01/2005,CF03,1,,152,52,22,0,,,,0,1,1,1
81624,000000081624-2,25/01/2005,CF03,1,,152,57,25,0,,0,,1,1,2,2
105612,000000105612-2,23/11/2004,CF03,1,,152,71,31,0,,1,20,1,0,,4
77425,000000077425-2,15/02/2005,CF03,1,,152,64,27,0,,1,10,12,0,,5
144617,000000144617-1,08/03/2005,CF03,1,,152,51,22,0,,0,,0,0,,6
1389,000000001389-2,08/03/2004,CF03,1,,152,67,29,0,,,,0,0,,1
5284,000000005284-1,17/01/2003,CF03,1,,152,,,0,,0,,,0,,5
5385,000000005385-2,26/09/2003,CF03,1,,152,89,38,0,,1,10,0,0,,5
5726,000000005726-1,15/09/2003,CF03,1,,152,56,24,0,,0,,0,0,,2
3189,000000003189-1,06/12/2002,CF03,,,152,54,23,0,,1,,0,1,1,5
144449,000000144449-1,03/03/2005,CF03,1,,152,60,26,1,10,,30,2,1,2,1
57367,000000057367-1,01/02/2005,CF03,1,,152,48,21,1,20,,50,0,0,,5
1959,000000001959-1,24/03/2004,CF03,1,,152,57,25,1,20,,25,0,0,,7
33710,000000033710-2,02/03/2005,CF03,1,,155,55,23,0,,0,,0,1,1,7
64137,000000064137-2,01/02/2005,CF03,1,,155,78,33,0,,1,10,1,1,1,1
139431,000000139431-1,11/01/2005,CF03,1,,155,47,19,0,,0,,0,0,,3
139549,000000139549-1,11/01/2005,CF03,1,,155,51,21,0,,,,1,1,2,2
141566,000000141566-1,01/02/2005,CF03,1,,155,89,37,0,,1,56,0,0,,5
140801,000000140801-1,25/01/2005,CF03,1,,155,49,20,0,,0,,1,1,2,3
7233,000000007233-1,02/02/2005,CF03,1,,155,66,28,0,,1,18,10,0,,2
140535,000000140535-1,18/01/2005,CF03,1,,155,68,28,0,,0,,0,1,3,3
148100,000000148100-1,04/04/2005,CF03,1,,155,73,30,0,,1,30,4,0,,4
1171,000000001171-2,25/02/2004,CF03,1,,155,73,30,0,,0,,0,1,2,3
2328,000000002328-1,28/02/2003,CF03,1,,155,54,22,0,,1,,20,1,1,2
4185,000000004185-1,15/10/2002,CF03,1,,155,57,24,0,,1,,0,0,,7
24053,000000024053-3,08/12/2004,CF03,1,,155,52,22,1,8,,49,1,0,,4
4862,000000004862-1,03/06/2003,CF03,1,,155,44,19,1,10,,,10,0,,4
85292,000000085292-2,23/11/2004,CF03,1,,157,65,26,0,,0,,14,1,2,1
3968,000000003968-2,02/12/2004,CF03,2,,157,64,26,0,,1,20,0,1,2,3
135788,000000135788-1,30/11/2004,CF03,1,,157,59,24,0,,0,,2,0,,1
70005,000000070005-2,18/01/2005,CF03,1,,157,65,26,0,,1,50,1,1,1,2
143710,000000143710-1,24/02/2005,CF03,1,,157,63,25,0,,0,,20,0,,5
89370,000000089370-2,21/03/2005,CF03,1,,157,89,36,0,,1,56,1,1,1,4
141941,000000141941-1,01/02/2005,CF03,1,,157,121,49,0,,0,,0,0,,4
138872,000000138872-1,05/01/2005,CF03,1,,157,70,28,0,,1,15,1,1,3,3
139040,000000139040-1,05/01/2005,CF03,1,,157,98,40,0,,1,38,0,1,1,3
112865,000000112865-2,30/11/2004,CF03,1,,157,52,21,0,,1,20,,1,2,5
85243,000000085243-1,11/01/2005,CF03,1,,157,67,27,0,,1,30,2,1,2,1
61397,000000061397-3,22/03/2005,CF03,1,,157,81,33,0,,1,5,20,1,1,2
104,000000000104-2,03/11/2003,CF03,1,,157,52,21,0,,0,,0,1,2,2
554,000000000554-2,19/01/2004,CF03,3,,157,74,30,0,,1,15,3,1,1,3
1582,000000001582-3,14/08/2003,CF03,1,,157,89,36,0,,,,,1,1,
2928,000000002928-2,01/12/2003,CF03,1,,157,73,29,0,,1,20,15,1,1,1
3032,000000003032-2,03/03/2004,CF03,1,,157,73,29,0,,1,8,10,0,,4
3635,000000003635-3,25/02/2004,CF03,1,,157,79,32,0,,1,30,4,1,1,7
3764,000000003764-1,06/12/2002,CF03,1,,157,64,26,0,,1,,0,1,2,
4107,000000004107-1,17/01/2003,CF03,1,,157,79,32,0,,1,,20,1,1,1
4391,000000004391-2,16/09/2003,CF03,1,,157,59,24,0,,,,4,1,2,2
130839,000000130839-1,10/11/2004,CF03,1,,157,59,24,1,10,,5,10,1,1,2
69634,000000069634-1,18/01/2005,CF03,1,,157,69,28,1,15,,30,0,1,2,3
39886,000000039886-1,15/03/2005,CF03,1,,157,,,1,5,,22,,0,,3
1799,000000001799-2,19/02/2004,CF03,1,,157,76,31,1,8,,3,0,1,2,7
1151,000000001151-3,11/01/2005,CF03,1,,160,70,27,0,,0,,0,1,2,5
30756,000000030756-3,15/02/2005,CF03,1,,160,57,22,0,,0,,1,1,2,1
133296,000000133296-1,15/11/2004,CF03,1,,160,76,30,0,,0,,,1,2,1
139081,000000139081-1,06/01/2005,CF03,1,,160,64,25,0,,0,,0,1,2,1
132801,000000132801-1,23/11/2004,CF03,1,,160,,,0,,1,16,1,1,1,1
132750,000000132750-1,19/11/2004,CF03,1,,160,72,28,0,,0,,0,1,1,5
76829,000000076829-1,23/03/2005,CF03,1,,160,64,25,0,,1,,0,0,,7
137244,000000137244-1,02/12/2004,CF03,1,,160,64,25,0,,1,1,3,0,,4
3167,000000003167-3,15/02/2005,CF03,1,,160,74,29,0,,1,30,3,1,2,3
95056,000000095056-2,22/03/2005,CF03,1,,160,44,17,0,,0,,0,0,,4
116257,000000116257-1,02/03/2005,CF03,1,,160,102,40,0,,1,32,0,1,2,
88248,000000088248-1,22/03/2005,CF03,1,,160,85,33,0,,0,,2,0,,2
147835,000000147835-1,29/03/2005,CF03,1,,160,49,19,0,,1,3,,1,1,5
5220,000000005220-2,07/10/2003,CF03,1,,160,73,28,0,,0,,0,1,1,2
7482,000000007482-1,03/06/2003,CF03,1,,160,70,27,0,,0,,1,1,2,2
8035,000000008035-2,10/11/2003,CF03,1,,160,102,40,0,,0,,2,1,1,1
8607,000000008607-1,25/02/2004,CF03,1,,160,76,30,0,,1,44,0,1,1,3
8672,000000008672-1,25/02/2004,CF03,1,,160,91,36,0,,1,8,0,0,,5
8744,000000008744-2,08/09/2003,CF03,1,,160,62,24,0,,1,,3,1,1,1
24866,000000024866-1,15/02/2005,CF03,1,,160,78,30,1,15,,16,2,1,2,4
98472,000000098472-2,22/03/2005,CF03,1,,160,95,37,1,15,,40,0,1,2,4
1533,000000001533-3,22/11/2004,CF03,1,,160,83,32,1,3,,20,4,1,2,7
1533,000000001533-2,23/10/2003,CF03,1,,160,83,33,1,15,,20,4,1,3,
6246,000000006246-2,17/02/2004,CF03,1,,160,69,27,1,10,,40,0,0,,1
8779,000000008779-2,23/03/2004,CF03,1,,160,52,20,1,20,,25,12,1,2,2
130082,000000130082-1,03/11/2004,CF03,1,,163,76,29,0,,1,4,2,1,2,7
7307,000000007307-2,05/01/2005,CF03,1,,163,95,36,0,,1,17,0,1,1,4
143668,000000143668-1,24/02/2005,CF03,1,,163,57,22,0,,0,,,0,,1
115373,000000115373-2,24/02/2005,CF03,1,,163,73,27,0,,0,,7,1,2,4
7041,000000007041-2,30/11/2004,CF03,1,,163,62,23,0,,0,,0,1,1,1
76685,000000076685-1,30/11/2004,CF03,1,,163,85,32,0,,1,,4,1,1,1
144578,000000144578-1,08/03/2005,CF03,1,,163,71,27,0,,1,,,0,,5
145078,000000145078-1,09/03/2005,CF03,1,,163,96,36,0,,0,,3,1,1,
145137,000000145137-1,10/03/2005,CF03,1,,163,89,34,0,,0,,,0,,3
145965,000000145965-1,23/03/2005,CF03,1,,163,49,19,0,,1,15,1,1,1,7
140683,000000140683-1,18/01/2005,CF03,1,,163,72,27,0,,1,8,8,0,,1
143240,000000143240-1,15/02/2005,CF03,1,,163,52,20,0,,0,,0,1,3,1
141166,000000141166-1,25/01/2005,CF03,1,,163,70,26,0,,0,,1,1,2,1
76460,000000076460-2,11/01/2005,CF03,1,,163,59,22,0,,1,39,2,0,,3
92385,000000092385-2,02/12/2004,CF03,1,,163,83,31,0,,1,,0,0,,5
137414,000000137414-1,08/12/2004,CF03,1,,163,54,20,0,,0,,0,1,2,4
30995,000000030995-3,15/02/2005,CF03,1,,163,62,23,0,,1,20,0,1,2,1
62620,000000062620-1,02/03/2005,CF03,1,,163,69,26,0,,1,4,3,0,,1
116343,000000116343-1,22/03/2005,CF03,1,,163,67,25,0,,1,40,8,1,2,3
125690,000000125690-2,29/03/2005,CF03,1,,163,79,30,0,,1,20,0,1,1,4
80930,000000080930-2,08/02/2005,CF03,1,,163,84,32,0,,0,,1,0,,7
65005,000000065005-4,22/11/2004,CF03,1,,163,92,35,0,,1,40,21,0,,7
964,000000000964-1,06/12/2002,CF03,,,163,64,24,0,,0,,0,0,,7
1441,000000001441-2,25/09/2003,CF03,1,,163,84,32,0,,0,,0,0,,1
1756,000000001756-2,15/10/2003,CF03,1,,163,83,31,0,,0,,0,1,1,2
5522,000000005522-2,13/02/2004,CF03,1,,163,83,31,0,,1,25,0,1,1,7
3862,000000003862-2,13/02/2004,CF03,1,,163,70,26,0,,1,2,1,1,2,1
4045,000000004045-1,08/12/2003,CF03,1,,163,76,29,0,,0,,2,1,1,7
4362,000000004362-1,26/09/2003,CF03,1,,163,77,29,0,,0,,0,1,1,2
6618,000000006618-1,17/01/2003,CF03,1,,163,70,26,0,,,,0,0,,
8403,000000008403-1,27/09/2002,CF03,1,,163,64,24,0,,1,,,1,2,7
8679,000000008679-1,30/01/2003,CF03,1,,163,83,31,0,,1,,6,1,2,2
9153,000000009153-2,17/02/2004,CF03,1,,163,64,24,0,,1,23,0,1,2,4
137650,000000137650-1,08/12/2004,CF03,1,,163,49,19,1,20,,35,14,1,2,7
141616,000000141616-1,01/02/2005,CF03,1,,163,103,39,1,10,,15,0,1,1,5
140730,000000140730-1,21/01/2005,CF03,1,,163,64,24,1,15,,30,0,0,,1
67328,000000067328-1,21/01/2005,CF03,1,,163,57,22,1,20,,23,,0,,7
145242,000000145242-1,15/03/2005,CF03,1,,163,80,30,1,8,,26,0,1,1,2
5058,000000005058-1,02/05/2003,CF03,1,,163,83,31,1,3,,,0,1,2,1
118492,000000118492-1,02/03/2005,CF03,1,,165,76,28,0,,1,,12,1,1,3
73424,000000073424-2,24/02/2005,CF03,1,,165,85,31,0,,1,25,16,1,2,3
22283,000000022283-3,08/03/2005,CF03,1,,165,62,23,0,,0,,0,0,,6
140127,000000140127-1,18/01/2005,CF03,1,,165,55,20,0,,0,,14,1,2,1
4590,000000004590-2,09/12/2004,CF03,1,,165,64,23,0,,0,,0,0,,5
138294,000000138294-1,09/12/2004,CF03,1,,165,86,32,0,,0,,0,0,,5
72322,000000072322-1,23/11/2004,CF03,1,,165,57,21,0,,0,,4,1,2,2
138867,000000138867-1,05/01/2005,CF03,1,,165,60,22,0,,1,5,2,1,3,2
144916,000000144916-1,08/03/2005,CF03,1,,165,95,35,0,,1,3,0,1,2,1
32945,000000032945-3,22/03/2005,CF03,1,,165,68,25,0,,0,,0,1,2,5
51,000000000051-2,04/12/2003,CF03,1,,165,79,29,0,,1,30,2,0,,4
208,000000000208-2,09/02/2004,CF03,1,,165,72,26,0,,1,30,1,1,2,3
1865,000000001865-2,19/01/2004,CF03,1,,165,89,33,0,,1,60,0,0,,4
5522,000000005522-1,07/05/2003,CF03,1,,165,83,30,0,,1,,0,0,,7
4035,000000004035-2,07/10/2003,CF03,1,,165,65,24,0,,0,,4,1,1,4
7675,000000007675-2,01/04/2004,CF03,1,,165,65,24,0,,1,20,10,1,2,5
9153,000000009153-1,11/08/2003,CF03,,,165,66,24,0,,1,20,,1,2,4
9166,000000009166-2,10/11/2003,CF03,1,,165,72,26,0,,1,20,2,1,1,2
14143,000000014143-1,08/03/2005,CF03,1,,165,82,30,1,10,,,0,1,1,4
145955,000000145955-1,22/03/2005,CF03,1,,165,,,1,50,,8,25,0,,2
2560,000000002560-2,08/09/2003,CF03,1,,165,58,21,1,10,,50,2,1,2,4
129941,000000129941-1,03/11/2004,CF03,1,,168,69,25,0,,,,0,1,1,
114073,000000114073-2,02/03/2005,CF03,10,,168,69,25,0,,0,,0,0,,
137952,000000137952-1,09/12/2004,CF03,1,,168,79,28,0,,,,14,1,2,3
12330,000000012330-2,18/01/2005,CF03,1,,168,75,27,0,,0,,0,1,1,2
138704,000000138704-1,05/01/2005,CF03,1,,168,64,23,0,,0,,1,1,2,3
141732,000000141732-1,01/02/2005,CF03,1,,168,76,27,0,,1,,7,1,2,1
142984,000000142984-1,15/02/2005,CF03,1,,168,68,24,0,,1,19,,0,,1
142155,000000142155-1,08/02/2005,CF03,1,,168,70,25,0,,1,6,2,1,1,2
144512,000000144512-1,07/03/2005,CF03,1,,168,57,20,0,,1,,5,1,2,
138614,000000138614-1,05/01/2005,CF03,1,,168,76,27,0,,0,,0,1,1,5
23563,000000023563-3,23/11/2004,CF03,1,,168,91,32,0,,1,40,0,1,1,1
110233,000000110233-2,02/12/2004,CF03,1,,168,73,26,0,,1,30,25,0,,1
118124,000000118124-2,02/03/2005,CF03,1,,168,83,30,0,,1,,12,1,2,5
208,000000000208-1,07/10/2002,CF03,1,,168,76,27,0,,1,,1,1,2,7
1146,000000001146-2,16/09/2003,CF03,1,,168,83,29,0,,1,30,18,0,,3
5654,000000005654-2,09/01/2004,CF03,1,,168,76,27,0,,1,46,1,1,2,1
3474,000000003474-2,10/11/2003,CF03,,,168,76,27,0,,1,40,0,0,,3
7125,000000007125-2,09/01/2004,CF03,1,,168,87,31,0,,0,,0,1,1,1
7343,000000007343-2,01/03/2004,CF03,1,,168,76,27,0,,1,28,14,0,,3
145970,000000145970-1,23/03/2005,CF03,1,,168,86,31,1,30,,30,6,0,,1
137190,000000137190-1,02/12/2004,CF03,1,,168,80,29,1,5,,26,36,1,2,3
111881,000000111881-1,02/03/2005,CF03,1,,168,83,29,1,10,,40,1,1,2,1
13056,000000013056-3,08/12/2004,CF03,1,,168,75,27,1,15,,55,2,0,,5
2136,000000002136-1,13/03/2003,CF03,1,,168,,,1,10,,,,,,5
135872,000000135872-1,30/11/2004,CF03,1,,170,70,24,0,,1,19,0,1,2,4
91758,000000091758-1,09/12/2004,CF03,1,,170,,,0,,0,,0,0,,
64531,000000064531-2,01/02/2005,CF03,1,,170,91,31,0,,1,8,2,0,,1
137420,000000137420-1,08/12/2004,CF03,1,,170,71,24,0,,1,10,3,1,2,1
132749,000000132749-1,19/11/2004,CF03,1,,170,58,20,0,,0,,4,1,3,3
3285,000000003285-2,15/02/2005,CF03,1,,170,105,36,0,,0,,18,0,,3
142854,000000142854-1,15/02/2005,CF03,1,,170,74,26,0,,0,,4,1,2,1
144577,000000144577-1,08/03/2005,CF03,1,,170,89,31,0,,1,20,0,1,2,1
95001,000000095001-1,16/02/2005,CF03,1,,170,76,26,0,,1,15,7,1,2,1
148072,000000148072-1,05/04/2005,CF03,1,,170,51,18,0,,0,,9,0,,1
142027,000000142027-1,01/02/2005,CF03,1,,170,64,22,0,,0,,0,1,3,1
143380,000000143380-1,15/02/2005,CF03,2,,170,71,24,0,,1,10,0,1,2,3
68942,000000068942-2,01/02/2005,CF03,1,,170,83,29,0,,1,46,0,1,1,4
23686,000000023686-3,25/01/2005,CF03,1,,170,77,27,0,,0,,0,1,2,1
109094,000000109094-2,23/11/2004,CF03,1,,170,70,24,0,,1,3,0,1,2,2
89188,000000089188-2,08/02/2005,CF03,3,,170,110,38,0,,1,17,0,0,,2
5852,000000005852-2,18/11/2003,CF03,1,,170,67,23,0,,1,10,30,1,2,1
2622,000000002622-1,11/09/2003,CF03,1,,170,47,16,0,,0,,7,1,2,4
4158,000000004158-1,20/05/2003,CF03,1,,170,67,23,0,,1,,10,0,,1
4207,000000004207-1,27/09/2002,CF03,1,,170,64,22,0,,,,,1,2,1
4510,000000004510-2,08/12/2003,CF03,1,,170,77,26,0,,0,,2,0,,1
6574,000000006574-1,06/12/2002,CF03,1,,170,73,25,0,,1,,0,0,1,5
7155,000000007155-2,19/01/2004,CF03,1,,170,64,22,0,,0,,8,1,2,3
145924,000000145924-1,21/03/2005,CF03,1,,170,72,25,1,2,,8,5,1,2,3
141663,000000141663-1,01/02/2005,CF03,1,,173,77,26,0,,0,,10,1,1,3
144144,000000144144-1,02/03/2005,CF03,1,,173,81,27,0,,1,10,4,1,2,3
39679,000000039679-3,15/03/2005,CF03,1,,173,75,25,0,,1,72,,1,3,1
62440,000000062440-2,15/03/2005,CF03,1,,173,79,27,0,,1,3,28,0,,2
88026,000000088026-1,29/03/2005,CF03,1,,173,83,28,0,,,,12,1,2,3
139842,000000139842-1,12/01/2005,CF03,1,,173,83,28,0,,1,,0,0,,1
139976,000000139976-1,17/01/2005,CF03,1,,173,85,28,0,,0,,5,0,,1
140804,000000140804-1,25/01/2005,CF03,2,,173,95,32,0,,0,,0,0,,1
86144,000000086144-1,19/01/2005,CF03,1,,173,67,22,0,,1,40,0,0,,3
141336,000000141336-1,27/01/2005,CF03,1,,173,86,29,0,,0,,14,1,3,2
144461,000000144461-1,07/03/2005,CF03,1,,173,95,32,0,,0,,30,0,,2
143605,000000143605-1,24/02/2005,CF03,1,,173,83,28,0,,1,51,28,0,2,1
105609,000000105609-1,10/03/2005,CF03,1,,173,67,22,0,,1,5,4,1,2,3
142000,000000142000-1,01/02/2005,CF03,1,,173,64,21,0,,0,,0,1,2,8
138954,000000138954-1,05/01/2005,CF03,1,,173,65,22,0,,1,15,,1,1,
7947,000000007947-2,30/11/2004,CF03,1,,173,70,23,0,,1,50,2,1,2,3
3408,000000003408-1,08/12/2004,CF03,1,,173,102,34,0,,1,40,4,0,,3
139660,000000139660-1,11/01/2005,CF03,1,,173,83,28,0,,1,20,40,0,,3
15204,000000015204-3,08/02/2005,CF03,1,,173,83,28,0,,1,30,2,1,2,1
14816,000000014816-2,29/03/2005,CF03,1,,173,80,27,0,,0,,1,0,,2
363,000000000363-2,10/12/2003,CF03,1,,173,79,26,0,,1,50,14,1,1,3
580,000000000580-1,07/11/2002,CF03,1,,173,66,22,0,,0,,,1,2,
7118,000000007118-1,09/02/2004,CF03,2,,173,83,28,0,,1,20,12,1,2,3
7447,000000007447-1,03/11/2003,CF03,1,,173,95,32,0,,1,20,6,1,2,3
145961,000000145961-1,22/03/2005,CF03,1,,173,89,30,1,9,,40,10,0,1,7
70554,000000070554-3,15/03/2005,CF03,1,,175,83,27,0,,1,20,30,1,2,3
113721,000000113721-1,08/02/2005,CF03,1,,175,103,34,0,,1,22,0,0,,7
144818,000000144818-1,08/03/2005,CF03,1,,175,,,0,,1,2,0,1,2,1
105788,000000105788-1,15/02/2005,CF03,,,175,107,35,0,,1,30,0,0,,3
11256,000000011256-2,09/03/2005,CF03,1,,175,78,25,0,,1,20,8,0,,2
76622,000000076622-1,30/03/2005,CF03,1,,175,78,25,0,,1,,4,1,2,3
15267,000000015267-2,03/11/2004,CF03,1,,175,72,23,0,,1,10,7,1,2,2
141954,000000141954-1,01/02/2005,CF03,1,,175,68,22,0,,0,,2,1,3,4
140543,000000140543-1,18/01/2005,CF03,1,,175,64,21,0,,0,,20,1,2,3
88636,000000088636-2,01/02/2005,CF03,1,,175,68,22,0,,1,45,4,1,1,3
75477,000000075477-2,18/01/2005,CF03,1,,175,85,28,0,,0,,1,1,1,4
146235,000000146235-1,22/03/2005,CF03,1,,175,98,32,0,,0,,6,0,,1
34087,000000034087-1,30/11/2004,CF03,1,,175,66,22,0,,0,,2,0,,5
1435,000000001435-1,19/11/2003,CF03,1,,175,96,31,0,,1,48,0,1,2,3
1615,000000001615-2,11/02/2004,CF03,3,,175,98,32,0,,0,,,1,2,2
3753,000000003753-2,25/02/2004,CF03,1,,175,80,26,0,,1,12,8,1,2,3
8493,000000008493-2,18/11/2003,CF03,1,,175,75,25,0,,0,,10,1,2,4
97825,000000097825-2,29/03/2005,CF03,1,,175,64,21,1,20,1,,24,1,2,1
395,000000000395-1,07/05/2003,CF03,1,,175,68,22,1,10,,,0,1,2,
132317,000000132317-1,17/11/2004,CF03,1,,178,76,24,0,,0,,10,1,2,1
111897,000000111897-2,11/01/2005,CF03,1,,178,51,16,0,,0,,0,1,2,1
138828,000000138828-1,05/01/2005,CF03,1,,178,83,26,0,,0,,2,1,2,1
140430,000000140430-1,18/01/2005,CF03,3,,178,72,23,0,,1,2,0,1,2,4
140223,000000140223-1,18/01/2005,CF03,1,,178,89,28,0,,0,,3,0,,2
144805,000000144805-1,08/03/2005,CF03,1,,178,78,25,0,,1,15,21,1,2,1
713,000000000713-1,22/03/2005,CF03,1,,178,95,30,0,,1,,,0,,1
147601,000000147601-1,29/03/2005,CF03,1,,178,83,26,0,,1,4,10,1,2,3
126457,000000126457-1,21/09/2004,CF03,1,,178,87,28,0,,0,,10,1,3,4
139210,000000139210-1,11/01/2005,CF03,1,,178,89,28,0,,1,50,0,1,1,3
88483,000000088483-1,12/01/2005,CF03,1,,178,83,26,0,,0,,0,1,2,4
142858,000000142858-1,15/02/2005,CF03,1,,178,83,26,0,,0,,12,1,2,2
142866,000000142866-1,16/02/2005,CF03,1,,178,81,26,0,,0,,0,1,1,1
140658,000000140658-1,18/01/2005,CF03,1,,178,79,25,0,,0,,12,1,2,7
5083,000000005083-1,08/02/2005,CF03,1,,178,,,0,,1,50,0,1,2,1
3241,000000003241-1,06/12/2002,CF03,1,,178,118,37,0,,1,,20,,,7
5182,000000005182-2,11/08/2003,CF03,1,,178,77,24,0,,1,30,20,1,1,3
5182,000000005182-3,30/03/2004,CF03,1,,178,81,26,0,,1,16,38,0,,3
8783,000000008783-2,20/01/2004,CF03,1,,178,114,36,0,,1,,0,1,1,1
139517,000000139517-1,11/01/2005,CF03,1,,178,83,26,1,10,,15,30,0,,5
140189,000000140189-1,18/01/2005,CF03,1,,180,106,32,0,,1,20,4,0,,1
114276,000000114276-1,25/01/2005,CF03,1,,180,71,22,0,,1,20,40,1,1,3
109488,000000109488-1,15/02/2005,CF03,1,,180,76,23,0,,0,,14,1,2,3
21174,000000021174-1,02/03/2005,CF03,1,,180,89,27,0,,1,17,12,0,,3
106188,000000106188-2,29/03/2005,CF03,1,,180,97,30,0,,0,,0,1,2,1
67805,000000067805-3,01/02/2005,CF03,1,,180,79,24,0,,1,20,30,1,2,3
115321,000000115321-2,05/01/2005,CF03,1,,180,108,33,0,,1,50,18,1,2,1
10075,000000010075-1,23/11/2004,CF03,1,,180,83,25,0,,0,,0,0,,4
3593,000000003593-2,10/12/2003,CF03,1,,180,70,21,0,,1,51,1,0,,1
6816,000000006816-1,07/05/2003,CF03,1,,180,89,27,0,,1,,10,0,,3
6816,000000006816-2,25/02/2004,CF03,1,,180,90,28,0,,1,,18,0,,3
6972,000000006972-1,11/06/2003,CF03,1,,180,79,24,0,,0,,,1,2,3
7230,000000007230-2,15/10/2003,CF03,1,,180,102,31,0,,1,10,40,1,2,3
142970,000000142970-1,15/02/2005,CF03,1,,183,96,29,0,,1,,8,1,1,3
147599,000000147599-1,29/03/2005,CF03,1,,183,90,27,0,,1,13,10,0,,4
165,000000000165-2,12/01/2004,CF03,1,,183,99,30,0,,1,40,8,0,,7
18120,000000018120-2,05/01/2005,CF03,1,,185,102,30,0,,0,,0,1,2,7
76500,000000076500-2,10/02/2005,CF03,1,,185,98,29,0,,1,10,6,1,2,1
143508,000000143508-1,18/02/2005,CF03,1,,185,108,31,0,,1,10,1,1,1,3
144080,000000144080-1,02/03/2005,CF03,1,,185,87,25,0,,,,8,1,3,1
1872,000000001872-2,12/01/2004,CF03,1,,185,159,46,0,,1,30,20,0,,1
8239,000000008239-1,08/12/2003,CF03,1,,185,69,20,0,,1,20,0,0,,5
142237,000000142237-1,08/02/2005,CF03,1,,188,61,17,0,,1,8,0,0,,1
34843,000000034843-2,30/11/2004,CF03,1,,188,121,34,0,,1,20,8,1,2,3
3215,000000003215-3,19/01/2004,CF03,1,,188,92,26,0,,1,40,1,1,2,3
1390,000000001390-1,20/02/2003,CF03,1,,188,79,22,1,20,,,0,1,2,7
77164,000000077164-3,02/03/2005,CF03,1,,190,135,37,0,,0,,4,1,2,1
81824,000000081824-2,11/01/2005,CF03,1,,190,84,23,0,,1,25,3,1,2,1
24520,000000024520-1,07/03/2005,CF03,1,,190,108,30,0,,1,2,3,1,1,1
33165,000000033165-1,10/02/2005,CF03,1,,190,98,27,0,,1,10,3,0,,1
138980,000000138980-1,05/01/2005,CF03,1,,190,96,26,0,,1,23,10,1,2,2
148559,000000148559-1,04/04/2005,CF03,1,,190,95,26,0,,1,20,8,1,3,3
110455,000000110455-2,31/01/2005,CF03,1,,193,100,27,0,,1,25,0,1,2,5
139158,000000139158-1,07/01/2005,CF03,1,,193,102,27,1,40,,34,0,1,2,7
47,000000000047-2,03/03/2004,CF03,,,193,108,29,1,20,,25,5,0,,7
141209,000000141209-1,25/01/2005,CF03,1,,196,99,26,0,,0,,3,1,2,4
16378,000000016378-3,05/01/2005,CF03,1,,208,83,19,0,,1,20,3,1,1,5
137027,000000137027-1,02/12/2004,CF05,1,,,,,,,,,,,,
140216,000000140216-1,18/01/2005,CF05,,,,,,,,,,,,,
2065,000000002065-1,02/03/2005,CF05,1,,,71,,0,,1,45,,1,2,2
145274,000000145274-1,16/03/2005,CF05,1,,,64,,0,,,,1,0,,6
143870,000000143870-1,28/02/2005,CF05,,,,70,,0,,1,15,14,1,1,1
147109,000000147109-1,22/03/2005,CF05,1,,,,,0,,0,,10,1,1,8
3536,000000003536-1,24/03/2004,CF05,1,,,,,0,,0,,0,0,,2
7781,000000007781-1,11/08/2003,CF05,1,,,,,0,,1,,,1,2,1
8693,000000008693-1,28/02/2003,CF05,7,,,,,0,,1,,1,1,1,4
145395,000000145395-1,15/03/2005,CF05,1,,,,,1,10,,5,,0,,
136084,000000136084-1,30/11/2004,CF05,1,,,69,,1,10,1,17,56,1,2,2
7659,000000007659-1,03/06/2003,CF05,1,,,57,,1,10,,,0,,,5
4762,000000004762-1,13/09/2002,CF05,1,,122,48,32,0,,0,,0,0,,
143074,000000143074-1,15/02/2005,CF05,1,,147,54,25,0,,0,,0,1,1,3
157,000000000157-2,10/12/2003,CF05,1,,147,64,29,0,,1,,4,0,,7
2906,000000002906-2,08/09/2003,CF05,1,,147,58,27,0,,0,,0,0,,2
6211,000000006211-3,09/02/2004,CF05,1,,147,51,23,0,,0,,,0,,5
6751,000000006751-2,10/11/2003,CF05,1,,147,70,32,0,,1,25,0,1,3,2
148679,000000148679-1,07/04/2005,CF05,,,147,71,33,1,15,,50,2,1,2,7
147512,000000147512-1,29/03/2005,CF05,,,150,103,46,0,,1,21,0,1,2,5
13604,000000013604-2,22/03/2005,CF05,1,,150,51,23,0,,,,,0,,6
4531,000000004531-2,09/02/2004,CF05,1,,150,66,29,0,,0,,2,1,2,3
6211,000000006211-2,01/07/2003,CF05,1,,150,57,25,0,,,,,1,3,
105843,000000105843-2,03/03/2005,CF05,1,,150,76,34,1,20,,30,0,1,2,7
132907,000000132907-1,23/11/2004,CF05,1,,152,64,27,0,,1,5,6,1,2,1
139435,000000139435-1,11/01/2005,CF05,1,,152,83,36,0,,1,40,20,1,1,2
62925,000000062925-1,15/02/2005,CF05,,1,152,77,33,0,,1,40,0,0,,4
112227,000000112227-1,24/02/2005,CF05,1,,152,79,34,0,,0,,0,0,,1
144721,000000144721-1,08/03/2005,CF05,1,,152,78,33,0,,1,30,3,0,,2
139979,000000139979-1,17/01/2005,CF05,1,,152,55,24,0,,1,30,2,0,,5
18262,000000018262-1,07/04/2005,CF05,1,,152,54,23,0,,1,,,0,,3
142731,000000142731-1,08/02/2005,CF05,1,,152,46,20,0,,0,,0,1,2,4
139643,000000139643-1,11/01/2005,CF05,1,,152,71,31,0,,0,,7,0,,2
137495,000000137495-1,08/12/2004,CF05,1,,152,67,29,0,,0,,1,0,,2
147011,000000147011-1,22/03/2005,CF05,1,,152,52,22,0,,1,20,0,0,,2
80517,000000080517-2,15/03/2005,CF05,1,,152,71,30,0,,0,,2,1,,3
110609,000000110609-1,24/03/2005,CF05,1,,152,54,23,0,,0,,0,1,1,1
200,000000000200-1,10/11/2003,CF05,1,,152,70,30,0,,1,10,0,0,,5
216,000000000216-2,08/09/2003,CF05,,,152,75,32,0,,0,,0,1,2,4